{"text_format":"1","workbook":"xlsx","n_sheets":2,"sheets":["Office 365 Account","Γυμνάσιο Πετράκη Κυπριανού"],"not_rendered":{"charts":0,"images":0,"macros":1,"external_links":0,"defined_names":0,"comments":0,"pivot_tables":0},"unopened":[],"bounds":{"document_bytes":16777216,"sheet_cells":100000,"rows_first":2000,"rows_last":500,"rows_between":2000,"halvings":0,"cell_chars":16384,"cell_head_chars":4096},"cells_cut":0,"cells_raw":0,"read":"whole","date_system":"1900"}

{"sheet":"Office 365 Account","index":0,"n_rows":19,"n_cols":6,"rows_kept":19,"cut":false,"hidden":false,"merged":[[7,0,7,2],[6,3,7,3],[6,1,6,2],[6,4,8,5]]}
[]
[]
[]
[]
[]
[]
[null,"Δώστε αριθμό Ταυτότητας Μαθητή:",null,0,"<====    Μην συμπεριλάβετε την παύλα ( - ) στον αριθμό ταυτότητας                    `         \n<====     Π.χ:  Αν ο αριθμός ταυτότητας είναι 03-12345678, να βάλετε 0312345678\nΤαυτότητες με χαρακτήρες (πχ AN1234567), πρέπει να είναι στα Αγγλικά"]
["Student's ID:"]
[]
[]
[]
[]
["Τμήμα","ID","Επίθετο","Όνομα","Office 365 email","Password"]
[{"$f":"VLOOKUP('Office 365 Account'!$D$7,'Γυμνάσιο Πετράκη Κυπριανού'!$A$2:$F$410,2,FALSE)","v":{"$error":"#N/A"}},{"$f":"VLOOKUP('Office 365 Account'!$D$7,'Γυμνάσιο Πετράκη Κυπριανού'!$A$1:$F$410,1,FALSE)","v":{"$error":"#N/A"}},{"$f":"VLOOKUP('Office 365 Account'!$D$7,'Γυμνάσιο Πετράκη Κυπριανού'!$A$2:$F$410,3,FALSE)","v":{"$error":"#N/A"}},{"$f":"VLOOKUP('Office 365 Account'!$D$7,'Γυμνάσιο Πετράκη Κυπριανού'!$A$2:$F$410,4,FALSE)","v":{"$error":"#N/A"}},{"$f":"VLOOKUP('Office 365 Account'!$D$7,'Γυμνάσιο Πετράκη Κυπριανού'!$A$2:$F$410,5,FALSE)","v":{"$error":"#N/A"}},{"$f":"VLOOKUP('Office 365 Account'!$D$7,'Γυμνάσιο Πετράκη Κυπριανού'!$A$2:$F$410,6,FALSE)","v":{"$error":"#N/A"}}]
[]
[]
[]
[]
[null,null,{"$f":"IF(AND(ISNA(D14),D7<>0),\"Λάθος Ταυτότητα.  Παρακαλώ επικοινωνείστε με το σχολείο.  Wrong ID.  Please contact School\",\" \")","v":" "}]

{"sheet":"Γυμνάσιο Πετράκη Κυπριανού","index":1,"n_rows":410,"n_cols":6,"rows_kept":410,"cut":false,"hidden":true,"merged":[]}
["Αρ. Ταυτότητας","Τμήμα","Επώνυμο","Όνομα","Username","Password"]
[40217,"Β3","Κούμ Λουέκ","Ράϊαν","rkoum-louek@st.schools.ac.cy","uy*Nvd6:"]
[1103492,"Γ2","Παπαδημητρίου","Αιμιλία","apapadimitriou2@st.schools.ac.cy","MpN%U_c2"]
[1105206,"Γ2","Λουκά","Λούκας","llouka8@st.schools.ac.cy","YtL;6!C*"]
[1113739,"Γ3","Μιχαήλ","Αντρέας","amichail79@st.schools.ac.cy","W=c6F?-5"]
[1131726,"Γ3","Μαλεκκίδης","Ειρηναίος","emalekkidis@st.schools.ac.cy","eN8#:%NT"]
[1131775,"Γ5","Θεοδόση","Θεογνωσία","ththeodosi@st.schools.ac.cy","a@T6_?fh"]
[1135363,"Γ3","Μπακίρ","Μιχάλης","mmpakir@st.schools.ac.cy","Ea!Y@y3#"]
[1135802,"Γ4","Δημητρίου","Ιωάννης","idimitriou12@st.schools.ac.cy","Y79-3*$;"]
[1136696,"Β1","Θεοδώρου","Μιχαήλ","mtheodorou14@st.schools.ac.cy","eEAJ?9Kz"]
[1137390,"Γ4","Αργυρού","Σωτήρης","sargyrou3@st.schools.ac.cy","TH5k$a*S"]
[1137473,"Γ4","Στυλιανού","Ελένη","estylianou19@st.schools.ac.cy","f:VW@X7L"]
[1137824,"Γ4","Αντρέου","Αντρέας","aantreou21@st.schools.ac.cy","Rmx*9cLd"]
[1137825,"Γ4","Αντρέου","Χρίστος","chantreou9@st.schools.ac.cy","qD8_&SVJ"]
[1138073,"Γ1","Παύλου","Αναστασία","apavlou21@st.schools.ac.cy","KA7*kMkK"]
[1138500,"Γ3","Παναγή","Κριστίνα","kpanagi18@st.schools.ac.cy","GvCE?s7X"]
[1138812,"Γ2","Πέτρου","Στυλιάνα","spetrou14@st.schools.ac.cy","v4%MmyZG"]
[1139211,"Γ5","Φανάρη","Μαρία","mfanari@st.schools.ac.cy","neJwL3#V"]
[1139308,"Γ2","Κυριάκου","Στέφανος","skyriakou37@st.schools.ac.cy","ctx3B4:&"]
[1140067,"Γ2","Μαυρίδης","Αντρέας","amavridis2@st.schools.ac.cy","C9b#2rJX"]
[1140089,"Γ3","Καϊττάνης","Ραφαήλ","rkaittanis@st.schools.ac.cy","F=d3TB@!"]
[1140391,"Γ3","Γεωργίου","Μάριος","mgeorgiou89@st.schools.ac.cy","Gyns+B4*"]
[1140460,"Γ4","Κραμβή","Ελένη","ekramvi@st.schools.ac.cy","nmg3sR??"]
[1140620,"Γ4","Πιερή","Γιάννης","gpieri4@st.schools.ac.cy","XJGB9$$*"]
[1140726,"Γ1","Κουζαλή","Θάλεια-Ελένη","thkouzali@st.schools.ac.cy","GxqvG3!n"]
[1140975,"Γ3","Κίρλαππου","Χρυστάλλα","chkirlappou@st.schools.ac.cy","mX3g%3c#"]
[1141100,"Γ2","Παναγή","Μάμας","banagi18@st.schools.ac.cy","kvZr?M6$"]
[1141127,"Γ5","Ευγενίου","Δέσποινα","devgeniou@st.schools.ac.cy","v8Mg4U&6"]
[1141186,"Γ2","Κυριάκου","Μιχάλης","mkyriakou56@st.schools.ac.cy","C#+A5u9A"]
[1141892,"Γ2","Κεφαλιού","Αντρέας","akefaliou@st.schools.ac.cy","X$VJc&+9"]
[1141949,"Γ2","Μαλαθούρα","Χριστόφορος","chmalathoura@st.schools.ac.cy","qAc7+L@e"]
[1142023,"Γ4","Ηλία","Μαρίλια","milia10@st.schools.ac.cy","aQ9-4#eh"]
[1142352,"Γ2","Μηλιώτης","Κυριάκος","kmiliotis@st.schools.ac.cy","k%95uRv5"]
[1142365,"Γ1","Χριστοδούλου","Παναγιώτης","pchristodoulou23@st.schools.ac.cy","H2rh9Qa*"]
[1142706,"Γ2","Μυλωνά","Χρυσταλλένη","chmylona3@st.schools.ac.cy","YYCFH6%@"]
[1142849,"Γ3","Στρούθου","Χαράλαμπος","chstrouthou@st.schools.ac.cy","MTGp$h5a"]
[1143198,"Γ2","Νικόλα","Αντώνης","anikola3@st.schools.ac.cy","Ae89es@L"]
[1143214,"Γ2","Κουρτελλή","Νικόλ","nkourtelli@st.schools.ac.cy","a?5?B9&c"]
[1143293,"Γ4","Τσιάπου","Κωνσταντίνα","ktsiapou@st.schools.ac.cy","YtGA!8dd"]
[1143414,"Γ4","Νικολάου","Μαρία","mnikolaou50@st.schools.ac.cy","bHtjE6D%"]
[1143979,"Γ4","Βασιλείου","Κυριάκος","kvasileiou10@st.schools.ac.cy","jc%3=YzF"]
[1144083,"Γ1","Τάλαρου","Μαριλένα","mtalarou@st.schools.ac.cy","v599?!B;"]
[1144137,"Γ2","Ευαγγέλου","Ειρήνη","eevangelou6@st.schools.ac.cy","SNR2n@:G"]
[1144192,"Γ4","Πίττας","Αναστάσιος","apittas3@st.schools.ac.cy","yDv@Gyj5"]
[1144272,"Γ1","Κυριάκου","Περικλής","pkyriakou26@st.schools.ac.cy","cnQ5+pt!"]
[1144372,"Γ1","Λάμπρου","Έλενα","elamprou4@st.schools.ac.cy","y#mA+9Tn"]
[1144819,"Γ3","Καραμούττης","Χρίστος","chkaramouttis@st.schools.ac.cy","L4&Krr6="]
[1144820,"Γ1","Θεοδοσίου","Θεοδόσης","ththeodosiou2@st.schools.ac.cy","qB?d3@YS"]
[1145063,"Γ1","Λουκάτζιη","Κωνσταντίνα","kloukatzii@st.schools.ac.cy","b!GsTpL5"]
[1145370,"Γ4","Θεοδώρου","Κατερίνα","ktheodorou11@st.schools.ac.cy","TF&V9?Q*"]
[1145475,"Γ2","Γρηγορίου","Έλενα","egrigoriou5@st.schools.ac.cy","L58$9Fw&"]
[1145477,"Γ5","Ζαννέτου","Σώτια","szannetou2@st.schools.ac.cy","ngz!P5my"]
[1145564,"Γ2","Αδάμου","Μάριος","madamou7@st.schools.ac.cy","J=8$8Ke3"]
[1145565,"Γ2","Αδάμου","Αντώνης","aadamou10@st.schools.ac.cy","saQ7B#*9"]
[1145669,"Γ3","Χριστοφή","Βίβιαν","vchristofi2@st.schools.ac.cy","VRd4d;$?"]
[1145898,"Γ3","Παναγιώτου","Χριστόφορος","chpanagiotou28@st.schools.ac.cy","Us949@FT"]
[1146407,"Γ3","Κάμινικ","Σιακίρα-Πετρούλα","skaminik@st.schools.ac.cy","vvf2A:!Z"]
[1146653,"Γ5","Πίτσιλλου","Χρίστος","chpitsillou2@st.schools.ac.cy","Zhb@Y=p2"]
[1147232,"Γ1","Παπαζαχαρία","Νικόλας","npapazacharia@st.schools.ac.cy","fw!5nf*B"]
[1147262,"Γ3","Χριστοδουλίδης","Ερνέστος-Θεόδωρος","echristodoulidis@st.schools.ac.cy","aHv-A?R6"]
[1147588,"Γ4","Χατζηστεφάνου","Στέφανος","schatzistefanou2@st.schools.ac.cy","AX$4FtpR"]
[1147642,"Γ3","Φαμιγλιέττι","Ελένη","efamiglietti@st.schools.ac.cy","c2@a@9Ap"]
[1147990,"Γ2","Θεοδώρου","Ιωάννα","itheodorou7@st.schools.ac.cy","t:?d9Jd;"]
[1148047,"Β4","Δημητρίου","Μιχαέλλα","mdimitriou53@st.schools.ac.cy","Us7;%6sZ"]
[1148365,"Γ2","Μιχαήλ","Άννα Χριστίνα","amichail78@st.schools.ac.cy","WNt-j#*4"]
[1148881,"Γ4","Δημητρίου","Νικόλας","ndimitriou31@st.schools.ac.cy","V3x*#:;E"]
[1148939,"Γ2","Νεοφύτου","Κυπριανός","kneofytou12@st.schools.ac.cy","ESb#3m2#"]
[1149260,"Γ5","Αλεξάνδρου","Ειρήνη","ealexandrou7@st.schools.ac.cy","C9?s5pm!"]
[1149322,"Γ4","Μιχαήλ","Παντελίτσα","pmichail23@st.schools.ac.cy","u--K%G5h"]
[1149483,"Γ5","Ντούκου","Γιούνις","gntoukou@st.schools.ac.cy","g6ENV#&v"]
[1149638,"Γ2","Δημητρίου","Ανδρούλλα","adimitriou64@st.schools.ac.cy","Yq5@B%W&"]
[1150165,"Γ4","Ατααλλάχ","Ηλίας","iataallach@st.schools.ac.cy","B@e9DzNy"]
[1150167,"Β1","Φωτίου","Αντώνης","afotiou11@st.schools.ac.cy","nNyTG!r8"]
[1150395,"Γ4","Χαραλάμπους","Πανάγια","pcharalampous48@st.schools.ac.cy","U5pyn$A4"]
[1150584,"Γ4","Ανδρέου","Όλγα","oandreou@st.schools.ac.cy","xN3v!Gk2"]
[1150594,"Γ1","Κουπφέρ","Κυριάκος","kkoupfer@st.schools.ac.cy","XE6?wyKY"]
[1150998,"Γ5","Αντρέου","Μάριος","mantreou18@st.schools.ac.cy","myz!P9:m"]
[1151015,"Γ4","Λοΐζου","Ευγένιος","eloizou8@st.schools.ac.cy","Sd6gK?!!"]
[1151021,"Γ2","Ποταμού","Γεωργία","gpotamou@st.schools.ac.cy","x&?aKuX2"]
[1151418,"Γ5","Λιασίδης","Κυριάκος","kliasidis2@st.schools.ac.cy","qGS!92S3"]
[1151547,"Γ1","Σκορδή","Χρήστος","chskordi2@st.schools.ac.cy","P#kD4ENg"]
[1152000,"Β2","Ρήγα","Αγγέλα","ariga@st.schools.ac.cy","X&M8g3AF"]
[1152001,"Β2","Ρήγα","Παναγιώτα","priga@st.schools.ac.cy","T!a6r7H*"]
[1152011,"Γ3","Λαμπή","Άννα","alampi2@st.schools.ac.cy","q8#VnWae"]
[1152087,"Β6","Δανιήλ","Ελένιος","edaniil@st.schools.ac.cy","Ac:v?U37"]
[1152311,"Γ2","Ανδρέου","Μιχάλης","mandreou54@st.schools.ac.cy","T&3j4v!g"]
[1152740,"Β5","Χριστοφόρου","Ιωνάς","ichristoforou7@st.schools.ac.cy","Q!ny=2Y2"]
[1152996,"Γ1","Λοΐζου","Αντριάνα","aloizou20@st.schools.ac.cy","WdVJ?z4T"]
[1153014,"Γ3","Νικολάου","Κυριακή","knikolaou39@st.schools.ac.cy","r2v$%Sy#"]
[1153060,"Γ5","Γαβριήλ","Κυριάκος","kgavriil5@st.schools.ac.cy","W_8@EdPk"]
[1153083,"Γ1","Κουμπαρή","Αντώνης","akoumpari2@st.schools.ac.cy","zpv%r9Au"]
[1153113,"Γ1","Μιχαήλ","Θεοδώρα","thmichail12@st.schools.ac.cy","G4fV$TzS"]
[1153744,"Γ3","Μαυρομμάτη","Νίκη","nmavrommati@st.schools.ac.cy","Qqs@9hjT"]
[1153917,"Γ5","Γεωργίου Αλ Απίτ","Κιμώνη","kgeorgiou-al-apit@st.schools.ac.cy","Q&%2Jqb-"]
[1153995,"Γ4","Αναστασίου","Δημήτρια","danastasiou5@st.schools.ac.cy","u9N$jK?C"]
[1154760,"Γ1","Ορθοδόξου","Μαρίνα","morthodoxou2@st.schools.ac.cy","Xypq?u8E"]
[1155558,"Γ3","Μιχαήλ","Ανθία-Άντρεα","amichail81@st.schools.ac.cy","eGf2=*h5"]
[1155668,"Γ1","Παπαγαβριήλ","Γαβριήλ","gpapagavriil@st.schools.ac.cy","zsb#U5ev"]
[1155848,"Γ1","Χριστοδούλου","Χρυστάλλα","chchristodoulou45@st.schools.ac.cy","NJa*FE8b"]
[1155871,"Γ2","Βροντή","Γεωργία","gvronti@st.schools.ac.cy","y8BP?ZX;"]
[1155951,"Γ5","Ατούλα","Βαλέρια","vatoula@st.schools.ac.cy","Rs@r8q7_"]
[1156154,"Γ3","Καρανικόλα","Φωτεινή","fkaranikola@st.schools.ac.cy","rWN*JVT9"]
[1156229,"Γ5","Ζαχαρίου","Φίλιππος","fzachariou@st.schools.ac.cy","Sa@r9k_m"]
[1156420,"Α5","Αντωνίου","Δημήτρης","dantoniou12@st.schools.ac.cy","SPM%3FXt"]
[1156451,"Β6","Αυξεντίου","Άντρια","aafxentiou4@st.schools.ac.cy","wM!3sc43"]
[1156634,"Γ5","Βασιλείου","Μιχάλης","mvasileiou21@st.schools.ac.cy","z7y&zNF5"]
[1156782,"Γ3","Ιωάννου","Μαργαρίτα","mioannou61@st.schools.ac.cy","t_WD7Vz*"]
[1157030,"Β5","Κώστα","Κωνσταντίνος","kkosta5@st.schools.ac.cy","VmgU*U=6"]
[1157073,"Β6","Ευαγγέλου","Χριστίνα","chevangelou13@st.schools.ac.cy","hf2pP;N%"]
[1157456,"Β2","Χατζηθωμά","Μαρίτα","mchatzithoma2@st.schools.ac.cy","f8GdcMf!"]
[1157457,"Β2","Χατζηθωμά","Χαράλαμπος","chchatzithoma@st.schools.ac.cy","rT5&Py7M"]
[1157458,"Β2","Χατζηθωμά","Γιώργος","nchatzithoma@st.schools.ac.cy","u5%C%t56"]
[1157643,"Β4","Παύλου","Αλέξης","apavlou20@st.schools.ac.cy","nV8&RRHU"]
[1157683,"Β6","Γεωργίου","Μαρία","mgeorgiou88@st.schools.ac.cy","T%5d?R;2"]
[1157869,"Β3","Αντρέου","Μαρία","mantreou17@st.schools.ac.cy","F#4-A@Ku"]
[1158014,"Β4","Ιακώβου","Αλέξανδρος","aiakovou14@st.schools.ac.cy","Hn8$3;+M"]
[1158036,"Β3","Αντωνίου","Παναγιώτης","pantoniou30@st.schools.ac.cy","ZQ=_8S*z"]
[1158156,"Β2","Μιχαήλ","Ραφαέλλα","rmichail8@st.schools.ac.cy","b%yQ3V+D"]
[1158246,"Β4","Κώστα","Μιχαέλλα","mkosta10@st.schools.ac.cy","a?3pFSZk"]
[1158354,"Β1","Λισγάρης","Γιώργος","glisgaris@st.schools.ac.cy","HT6$Tr#a"]
[1158546,"Β3","Αδάμου","Γεωργία-Εφραίμια","gadamou4@st.schools.ac.cy","BG!9q+vk"]
[1158611,"Β3","Πάλου","Αγγελίνα","apalou@st.schools.ac.cy","HjeP?kE2"]
[1158709,"Β5","Αντωνίου","Μαρίνα","mantoniou54@st.schools.ac.cy","Jdy2!YZz"]
[1158959,"Β1","Αβραάμ","Αβραάμ","aavraam10@st.schools.ac.cy","gjTLS9?L"]
[1159088,"Β1","Κίτση","Άντρια","akitsi@st.schools.ac.cy","hg3@P6X8"]
[1159166,"Β2","Ευθυμίου","Μάριος","mefthymiou5@st.schools.ac.cy","w?RT5QN$"]
[1159729,"Β3","Σιδεράς","Γιασεμής","gsideras2@st.schools.ac.cy","u!P3$EaZ"]
[1159959,"Β1","Νικολάου","Στέλλα","snikolaou44@st.schools.ac.cy","Kz-s9E&f"]
[1159997,"Β2","Λεονταρίτη","Καλλισθένη","kleontariti@st.schools.ac.cy","Rba6q#r3"]
[1160149,"Β2","Κουμής","Ιωάννης","ikoumis@st.schools.ac.cy","Qua6p&_P"]
[1160383,"Β2","Κωνσταντίνου","Δημήτρης","dkonstantinou22@st.schools.ac.cy","SDkuN!?9"]
[1160534,"Β1","Άσπρου","Κωνσταντίνος","kasprou2@st.schools.ac.cy","u4*xgP&A"]
[1160544,"Β5","Μισός","Αντρέας","amisos@st.schools.ac.cy","Dr&NH;7$"]
[1160548,"Β3","Αντρέου","Εβελίνα","eantreou6@st.schools.ac.cy","tC5%Qu@Y"]
[1160597,"Β5","Μιχαήλ","Γιώργος","gmichail31@st.schools.ac.cy","z3VL#acN"]
[1161628,"Β6","Καλλή","Κυριάκος","kkalli6@st.schools.ac.cy","U7kAEqj%"]
[1161703,"Β6","Παπαζαχαρίου","Λούης","lpapazachariou@st.schools.ac.cy","PFrdLw#9"]
[1161813,"Β1","Ιουλιανού","Αιμιλία","aioulianou2@st.schools.ac.cy","VkwY3a_%"]
[1161874,"Β5","Μπακίρ","Αμαλής","ampakir2@st.schools.ac.cy","C%6_k=a7"]
[1161952,"Β2","Δημοσθένους","Χάρης","chdimosthenous14@st.schools.ac.cy","DX5&-Fsv"]
[1162140,"Β4","Αντρέου","Άντρια","aantreou20@st.schools.ac.cy","Q42c#;G&"]
[1162469,"Β1","Πούμου","Ιουλία","ipoumou@st.schools.ac.cy","F#YqnKm7"]
[1162497,"Β5","Κόκκινου","Αγγελική","akokkinou6@st.schools.ac.cy","S7@%Czp*"]
[1162619,"Β6","Στυλιανού","Στυλιανός","sstylianou25@st.schools.ac.cy","rtM-!3GE"]
[1162667,"Β2","Πίττας","Χρίστος","chpittas2@st.schools.ac.cy","Mcr@T+Z5"]
[1162672,"Β1","Χατζηαναστασίου","Σωτηρία","schatzianastasiou@st.schools.ac.cy","AK5-tR%3"]
[1162927,"Β6","Γεωργίου","Παναγιώτα","pgeorgiou41@st.schools.ac.cy","y7CHr?8P"]
[1163063,"Β3","Στυλιανού","Αλέξανδρος","astylianou37@st.schools.ac.cy","eL@*3YVY"]
[1163101,"Β2","Αδαμίδης","Χριστάκης","chadamidis@st.schools.ac.cy","G7@;+G9q"]
[1163155,"Β5","Ιωνά","Ιζαμπέλ","iiona2@st.schools.ac.cy","JR9!B%d+"]
[1163163,"Β5","Κωνσταντινίδη","Σωτηρία","skonstantinidi@st.schools.ac.cy","WNrhpT2#"]
[1163218,"Β6","Λανίτης","Ερρίκος","elanitis@st.schools.ac.cy","sQ&J46HJ"]
[1163427,"Β1","Μπαχατούρ Κούνγκουωρ","Αντρέας","ampachatour-koungkouor@st.schools.ac.cy","b!QXa9f6"]
[1163736,"Α5","Παύλου","Στέφανος","spavlou6@st.schools.ac.cy","cm2gRe?F"]
[1163991,"Β6","Κάττου","Δημήτρης","dkattou@st.schools.ac.cy","zZ96XU?2"]
[1164280,"Β1","Πιερή","Αθανασία","apieri12@st.schools.ac.cy","t&t*A4M#"]
[1164282,"Β1","Πιερή","Ξένια","xpieri@st.schools.ac.cy","mpdUn%9D"]
[1164502,"Β6","Χριστοδούλου","Σωτήρης","schristodoulou52@st.schools.ac.cy","mr%QDc2y"]
[1164532,"Β3","Ζαχαρίου","Ελένη","ezachariou5@st.schools.ac.cy","c2eMhN%T"]
[1164990,"Β4","Βασιλείου","Μάριος-Απόστολος","mvasileiou22@st.schools.ac.cy","Ae2w*-Pe"]
[1165009,"Β4","Ανδρέου","Νικόλ","nandreou16@st.schools.ac.cy","Cv3@br;w"]
[1165084,"Β5","Αλεξάνδρου","Μαρία","malexandrou14@st.schools.ac.cy","Mh!42VS&"]
[1165159,"Β1","Χατζηαντώνη","Λαρίσα","lchatziantoni2@st.schools.ac.cy","Y3qbyg@h"]
[1165414,"Γ5","Παπανικολάου","Μάριος","bapanikolaou3@st.schools.ac.cy","MYc:&s2h"]
[1165704,"Β6","Προκοπίου","Μάμας","brokopiou7@st.schools.ac.cy","XD$U3h:6"]
[1165724,"Β4","Στυλιανού","Στυλιανός","sstylianou24@st.schools.ac.cy","T%6?q%fw"]
[1166024,"Β2","Γεωργίου","Στυλιάν","sgeorgiou70@st.schools.ac.cy","v2_%6VJa"]
[1166087,"Β6","Μηνά","Νικόλας","nmina@st.schools.ac.cy","Q8AS9wS&"]
[1166376,"Β2","Γεωργίου","Γεωργία","ngeorgiou82@st.schools.ac.cy","S?w3cmVw"]
[1166421,"Β6","Πετάης","Κωνσταντίνος","kpetais@st.schools.ac.cy","uz&J52YW"]
[1166427,"Β4","Εφραίμη","Αντώνης","aefraimi@st.schools.ac.cy","gZ6@XL3v"]
[1166497,"Β1","Κούρου","Σταματία","skourou@st.schools.ac.cy","aFP2B*;B"]
[1166998,"Α3","Χατζηχριστοφή","Σταύρος","schatzichristofi@st.schools.ac.cy","j-N8Fs&m"]
[1167173,"Α6","Αναστάση","Μαρίνος","manastasi5@st.schools.ac.cy","vTL:?4_@"]
[1167943,"Α1","Νικόλα","Γεώργιος","gnikola4@st.schools.ac.cy","TADn#9we"]
[1167992,"Β5","Νικηφόρου","Μιχαήλ-Αγγελος","mnikiforou@st.schools.ac.cy","uz8=U?mt"]
[1168001,"Α4","Τσιάπου","Αναστασία","atsiapou@st.schools.ac.cy","L64_y$b2"]
[1168032,"Β1","Ανδρέου","Παναγιώτης","pandreou21@st.schools.ac.cy","f7J@v9sE"]
[1168106,"Β3","Λυμπουρή","Ελιάνα","elympouri@st.schools.ac.cy","zTt%gdv8"]
[1168419,"Β5","Γεωργίου","Στυλιανή","sgeorgiou71@st.schools.ac.cy","Sad4?JHT"]
[1168465,"Α4","Αθανασίου","Ραφαήλ","rathanasiou2@st.schools.ac.cy","P#npYV3a"]
[1168718,"Β2","Αιμιλίου","Αντριάνα","aaimiliou2@st.schools.ac.cy","RSv5DtK*"]
[1168791,"Β2","Θωμά","Δημήτρης","dthoma2@st.schools.ac.cy","RUmp5m*r"]
[1168905,"Β4","Παναγιώτου","Γεωργία","gpanagiotou11@st.schools.ac.cy","T+R8j?bN"]
[1168915,"Β5","Βλαδίμηρου","Κυριακή","kvladimirou@st.schools.ac.cy","y9v+R*p%"]
[1169550,"Β2","Ζάκου","Μιχάλης","mzakou2@st.schools.ac.cy","G8&DtAqN"]
[1169739,"Β4","Καλλέσιης","Κωνσταντίνος","kkallesiis@st.schools.ac.cy","Ad%Q8fDv"]
[1169764,"Β4","Χαραλάμπους","Αντρέας","acharalampous113@st.schools.ac.cy","SJ5aUP&:"]
[1169852,"Β1","Κυριάκου","Ειρήνη","ekyriakou30@st.schools.ac.cy","p&N6mUF;"]
[1170304,"Β2","Νικόλα","Ελένη","enikola@st.schools.ac.cy","K-fJv?3L"]
[1170425,"Β1","Μιχαήλ","Άντρεα","amichail76@st.schools.ac.cy","YYFk2%hM"]
[1170685,"Β1","Σεργίου","Ελένη","esergiou3@st.schools.ac.cy","J?84LEha"]
[1170891,"Β6","Μιχαήλ","Σταυριάνα","smichail35@st.schools.ac.cy","ndVGf#5k"]
[1170896,"Β6","Γεωργίου","Έλενα","egeorgiou55@st.schools.ac.cy","jH!2$;u;"]
[1171596,"Β3","Καλλίνυ","Λούκας","lkalliny@st.schools.ac.cy","PBPZ@8JS"]
[1171612,"Β4","Δημητρίου","Αντρέας","adimitriou62@st.schools.ac.cy","SJ7;$!aM"]
[1171759,"Β1","Σοφοκλέους","Θεόδωρος","thsofokleous4@st.schools.ac.cy","B$%GRQU8"]
[1171760,"Β1","Σοφοκλέους","Μαρία","msofokleous9@st.schools.ac.cy","p*Gh5!=%"]
[1171901,"Β1","Κωνσταντίνου","Κωνστάνσια","kkonstantinou38@st.schools.ac.cy","WE%E3:dZ"]
[1172054,"Β2","Ιμπραχίμ","Λευτέρης","limprachim@st.schools.ac.cy","EG4=2ey%"]
{"$rows_left_out":210}